�s���{���R�[�h���͎s�撬���R�[�h,NO,�s���{����,�s�撬����,����,����_�J�i,����_�ʏ�,����_�p��,����������,���,�ꏊ����,�Z��,����,�ܓx,�o�x,�d�b�ԍ�,�����ԍ�,�����i���j,�����i�P�ʁj,�@�l�ԍ�,���L�ғ�,�������w���,���p�\�j��,�J�n����,�I������,���p�\�������L����,�摜,�摜_���C�Z���X,�T�v,�T�v_�p��,����,����_�p��,URL,���l
472018,1,���ꌧ,�ߔe�s,�����������Ɗ֌W����,�����E�L���E�R�N�I�E�V���E�P�J���P�C�V�����E,,,����,���j����,�ߔe�s���j������,���ꌧ�ߔe�s�v�Βn1-1-1�p���b�g������4�K,,,,098-869-5266,,,,,�ߔe�s,2006/6/9,,,,,,,,,,,,
472018,2,���ꌧ,�ߔe�s,�ʗ˕掺���,�^�}�E�h�D���{�V�c�Z�L�V���E,,,����,������,,���ꌧ�ߔe�s�񗢋��钬1-3,,,,,,,,,�ߔe�s,2018/12/25,,,,,,,,,,,,
472018,3,���ꌧ,�ߔe�s,������,�V�L�i�G��,,,���w��L�O��,���ʖ���,,���ꌧ�ߔe�s���^�n421-1�O,,,,,,,,,�ߔe�s,2000/3/30,,,,,,,,,,,,
472018,4,���ꌧ,�ߔe�s,�~�o����,�G���J�N�W�A�g,,,���w��L�O��,�j��,,���ꌧ�ߔe�s�񗢓�����1-1�O,,,,,,,,,���ꌧ�A�ߔe�s,1972/5/15,,,,,,,,,,,,
472018,5,���ꌧ,�ߔe�s,�񗢏��,�V�����W���E�A�g,,,���w��L�O��,�j��,,���ꌧ�ߔe�s�񗢓�����3-1-1�O,,,,,,,,,���A���ꌧ,1972/5/15,,,,,,,,,,,,
472018,6,���ꌧ,�ߔe�s,���g�{��,�X�G���V�O�E�A�g,,,���w��L�O��,�j��,,���ꌧ�ߔe�s�񗢖��g��1,,,,,,,,,�l,1972/5/15,,,,,,,,,,,,
472018,7,���ꌧ,�ߔe�s,�ʗ�,�^�}�E�h�D��,,,���w��L�O��,�j��,,���ꌧ�ߔe�s�񗢋��钬1-3�C3-1,,,,,,,,,���ꌧ�A�ߔe�s,1972/5/15,,,,,,,,,,,,
472018,8,���ꌧ,�ߔe�s,������ՌQ,���J���n�J�A�g�O��,,,���w��L�O��,�j��,,"���ꌧ�ߔe�s����2-3-1,2-10-1",,,,,,,,,�ߔe�s,2007/7/26,,,,,,,,,,,,
472018,9,���ꌧ,�ߔe�s,�ٔV���,�r���k�E�^�L,,,���w��L�O��,�j��,,���ꌧ�ߔe�s�񗢒��x��4-121�O,,,,,,,,,�ߔe�s,2018/10/15,,,,,,,,,,,,
472018,10,���ꌧ,�ߔe�s,�ɍ]�a���뉀,�C�G�h�D���`�e�C�G��,,,���w��L�O��,����,,���ꌧ�ߔe�s�񗢓�����2-21-1,,,,,,,,,�ߔe�s,1986/6/16,,,,,,,,,,,,
472018,11,���ꌧ,�ߔe�s,�ɍ]��a�ʓ@�뉀,�C�G�E�h�D���x�b�e�C�e�C�G��,,,���w��L�O��,����,,���ꌧ�ߔe�s�񗢐Η䒬1-62-1�O,,,,,,,,,�ߔe�s,2009/2/12,,,,,,,,,,,,
472018,12,���ꌧ,�ߔe�s,�񗢏鏑�@�E���V�Ԓ뉀,�V�����W���E�V���C���E�T�X�m�}�e�C�G��,,,���w��L�O��,����,,���ꌧ�ߔe�s�񗢓�����3-1�O,,,,,,,,,��,2009/7/23,,,,,,,,,,,,
472018,13,���ꌧ,�ߔe�s,�A�}�~�N�k���C�i�ٔV��ԁj,�A�}�~�N�k���C�i�r���k�E�^�L�j,,,���w��L�O��,����,,���ꌧ�ߔe�s�񗢒��x��4-121�O,,,,,,,,,�ߔe�s,2018/10/15,,,,,,,,,,,,
472018,14,���ꌧ,�ߔe�s,�������̼������ؔ����n,�V�L�i�G���m�V�}�`�X�W�m���n�b�Z�C�`,,,���w��L�O��,�V�R�L�O��,,���ꌧ�ߔe�s���^�n421-1�C7,,,,,,,,,�ߔe�s,1972/5/15,,,,,,,,,,,,
472018,15,���ꌧ,�ߔe�s,�񗢋���̑�A�J�M,�V�����L���W���E�m�I�I�A�J�M,,,���w��L�O��,�V�R�L�O��,,���ꌧ�ߔe�s�񗢋��钬3-18�C20,,,,,,,,,�ߔe�s,1972/5/15,,,,,,,,,,,,
472018,16,���ꌧ,�ߔe�s,�V�_�ƏZ��,�A���J�L�P�W���E�^�N,,,���w��d�v������,������;�Z��,,���ꌧ�ߔe�s�≮1-28-32,,,,,,,,,�l,2002/12/26,,,,,,,,,,,,
472018,17,���ꌧ,�ߔe�s,���~�o��������,�L���E�G���J�N�W�z�E�W���E�o�V,,,���w��d�v������,������;����,,���ꌧ�ߔe�s�񗢓�����2-1,,,,,,,,,���ꌧ,1972/5/15,,,,,,,,,,,,
472018,18,���ꌧ,�ߔe�s,�V����,�e���j���o�V,,,���w��d�v������,������;����,,���ꌧ�ߔe�s�񗢓�����1-2,,,,,,,,,���ꌧ,1972/5/15,,,,,,,,,,,,
472018,19,���ꌧ,�ߔe�s,������������y�ѐ��,�L���E�\�E�Q���W�_�C�C�`�����I���r�Z�L�V���E,,,���w��d�v������,������;���̑�,,���ꌧ�ߔe�s��1-9-1,,,,,,,,,�ߔe�s,1972/5/15,,,,,,,,,,,,
472018,20,���ꌧ,�ߔe�s,���䉮����ԐΖ�,�\�m�q�����E�^�L�C�V����,,,���w��d�v������,������;���̑�,,���ꌧ�ߔe�s�񗢐^�a�u��1-7,,,,,,,,,�ߔe�s,1972/5/15,,,,,,,,,,,,
472018,21,���ꌧ,�ߔe�s,�ɍ]��a��,�C�G�E�h�D���o�J,,,���w��d�v������,������;���̑�,,���ꌧ�ߔe�s�񗢐Η䒬1-62-4�O,,,,,,,,,�l,1999/12/1,,,,,,,,,,,,
472018,22,���ꌧ,�ߔe�s,�����i���񗢏鐳�a���j,�h�E�V���E�i�L���E�V�����W���E�Z�C�f���V���E�j,,,���w��L�`������,���p�H�|�i;�H�|�i;���H,���ꌧ�������فE���p��,���ꌧ�ߔe�s������܂�3-1-1,,,,098-941-8200,,,,,���ꌧ,1978/6/15,,,,,,,,,,,,
472018,23,���ꌧ,�ߔe�s,�����i���~�o���a�O���E�a�����E�����j,�{���V���E�i�L���E�G���J�N�W�[���V���E�E�f���`���E�V���E�E���E�V���E�j,,,���w��L�`������,���p�H�|�i;�H�|�i;���H,���ꌧ�������فE���p��,���ꌧ�ߔe�s������܂�3-1-1,,,,098-941-8200,,,,,���ꌧ,1978/6/15,,,,,,,,,,,,
472018,24,���ꌧ,�ߔe�s,�����낳����,�I�����\�E�V,,,���w��L�`������,���p�H�|�i;�T��,���ꌧ�������فE���p��,���ꌧ�ߔe�s������܂�3-1-1,,,,098-941-8200,,,,,���ꌧ,1973/6/6,,,,,,,,,,,,
472018,25,���ꌧ,�ߔe�s,�������W,�R���R�E�P���V���E,,,���w��L�`������,���p�H�|�i;�T��,���ꌧ�������فE���p��,���ꌧ�ߔe�s������܂�3-1-1,,,,098-941-8200,,,,,���ꌧ,1973/6/6,,,,,,,,,,,,
472018,26,���ꌧ,�ߔe�s,�c���ƕ����i�������c���Ɖƕ��j,�_�i�P�����W���i�t�}�Z�C�_�i�P�J�t�j,,,���w��L�`������,���p�H�|�i;�Õ���,���ꌧ�������فE���p��,���ꌧ�ߔe�s������܂�3-1-1,,,,098-941-8200,,,,,�l��,1973/6/6,,,,,,,,,,,,
472018,27,���ꌧ,�ߔe�s,���F�@���@���������R�����^��,�~���R�E�\�E�`���N�������E�L���E�R�N�`���E�U���I�E�V���E�V���A�e,,,���w��L�`������,���p�H�|�i;���j����,���ꌧ�������فE���p��,���ꌧ�ߔe�s������܂�3-1-1,,,,098-941-8200,,,,,���ꌧ,1999/6/7,,,,,,,,,,,,
472018,28,���ꌧ,�ߔe�s,�����|�p�����ʐ^<���q�F���Y�B�e>,�����E�L���E�Q�C�W���c�`���E�T�V���V��<�J�}�N�����V�^���E�T�c�G�C>,,,���w��L�`������,���p�H�|�i;���j����,���ꌧ���|�p��w,���ꌧ�ߔe�s�񗢋��钬3-6,,,,,,,,,���ꌧ,2005/6/9,,,,,,,,,,,,
472018,29,���ꌧ,�ߔe�s,�ɍ]��a�Ǝ���,�C�G�E�h�D���P�V�����E,,,���w��L�`������,���p�H�|�i;���j����,�ߔe�s���j������,���ꌧ�ߔe�s�v�Βn1-1-1�p���b�g������4�K,,,,098-869-5266,,,,,�l,,,,,,,,,,,,,
472018,30,���ꌧ,�ߔe�s,�������V�},�����E�L���E�R�N�m�Y,,,���w��L�`������,���p�H�|�i;���j����,���ꌧ���}����,���ꌧ�ߔe�s���2-20-1�@3F�`5F�@A�X��r��,,,,098-894-5858,,,,,���ꌧ,2016/8/17,,,,,,,,,,,,
472018,31,���ꌧ,�ߔe�s,�Ԑؐ},�}�M���Y,,,���w��L�`������,���p�H�|�i;���j����,���ꌧ�������فE���p��,���ꌧ�ߔe�s������܂�3-1-1,,,,098-941-8200,,,,,���ꌧ,2016/8/17,,,,,,,,,,,,
472018,32,���ꌧ,�ߔe�s,����������Δ�,,,,���w��L�`������,���p�H�|�i;���j����,���ꌧ�������فE���p��,���ꌧ�ߔe�s������܂�3-1-1,,,,098-941-8200,,,,,���ꌧ,2019/7/23,,,,,,,,,,,,
472018,33,���ꌧ,�ߔe�s,�����ÓT���y,�����E�L���E�R�e���I���K�N,,,���w�薳�`������,�d�v���`������;�|�\;���y,,���ꌧ�ߔe�s����,,,,,,,,,�Ɗ얼�@����,2000/6/6,,,,,,,,,,,,
472018,34,���ꌧ,�ߔe�s,�����ÓT���y,�����E�L���E�R�e���I���K�N,,,���w�薳�`������,�d�v���`������;�|�\;���y,,���ꌧ�ߔe�s�F�v��,,,,,,,,,�����@��Y,2019/10/25,,,,,,,,,,,,
472018,35,���ꌧ,�ߔe�s,�g�x���y�̎O��,�N�~�I�h���I���K�N�E�^�T���V��,,,���w�薳�`������,�d�v���`������;�|�\;�g�x,,���ꌧ�ߔe�s�^�V�A����^,,,,,,,,,��ԁ@�����Y�A���]��t,2005/8/30�A2011/9/5,,,,,,,,,,,,
472018,36,���ꌧ,�ߔe�s,�g�x���y����,�N�~�I�h���I���K�N�^�C�R,,,���w�薳�`������,�d�v���`������;�|�\;���y,,���ꌧ�ߔe�s�ɑ���,,,,,,,,,��Á@��,2017/10/2,,,,,,,,,,,,
472018,37,���ꌧ,�ߔe�s,�g�^,�r���K�^,,,���w�薳�`������,�d�v���`������;�H�|�Z�p;���D,,���ꌧ�ߔe�s�񗢎R�쒬,,,,,,,,,�ʓߔe�@�L��,1996/5/10,,,,,,,,,,,,
472018,38,���ꌧ,�ߔe�s,�񗢂̐D��,�V�����m�I�����m,,,���w�薳�`������,�d�v���`������;�H�|�Z�p;���D,,���ꌧ�ߔe�s�񗢒�ǒ�,,,,,,,,,�{���@���q,1998/6/8,,,,,,,,,,,,
472018,39,���ꌧ,�ߔe�s,�����i����`���|�\�j,�P�b�p�c�i�I�L�i���f���g�E�Q�C�m�E�j,,,���w��I��,�ۑ��Z�p,,���ꌧ�ߔe�s�哹,,,,,,,,,�Ôg�U�@���I,2008/9/11,,,,,,,,,,,,
472018,40,���ꌧ,�ߔe�s,�≮�̍r��,�c�{���m�A�����`,,,���w��I��,���`������;���|,���ꓩ��ۑ���,,,,,,,,,,,1977/6/1,,,,,,,,,,,,
472018,41,���ꌧ,�ߔe�s,�ߔe�����̃t�F�|�k�V�},�i�n�A�T�g�m�t�F�[�k�V�},,,���w��I��,���`����������,,���ꌧ�ߔe�s������,,,,,,,,,�ߔe����̪�Ǽϕۑ���,1979/12/7,,,,,,,,,,,,
472018,42,���ꌧ,�ߔe�s,����̍j����,�I�L�i���m�c�i�q�L,,,���w��I��,���`����������,,���ꌧ,,,,,,,,,,1994/12/7,,,,,,,,,,,,
472018,43,���ꌧ,�ߔe�s,�V�_�ƏZ��剮,�A���J�L�P�W���E�^�N�I����,,,�o�^�L�`������,������,,���ꌧ�ߔe�s�񗢖��g��2-124-2,,,,,,,,,�l���L,2007/7/31,,,,,,,,,,,,
472018,44,���ꌧ,�ߔe�s,�V�_�ƏZ��q���v��,�A���J�L�P�W���E�q���v��,,,�o�^�L�`������,������,,���ꌧ�ߔe�s�񗢖��g��2-124-2,,,,,,,,,�l���L,2007/7/31,,,,,,,,,,,,
472018,45,���ꌧ,�ߔe�s,�V�_�ƏZ��Ί_,�A���J�L�P�W���E�^�N�C�V�K�L,,,�o�^�L�`������,������,,���ꌧ�ߔe�s�񗢖��g��2-124-2,,,,,,,,,�l���L,2007/7/31,,,,,,,,,,,,
472018,46,���ꌧ,�ߔe�s,�V�_�ƏZ��t�[��,�A���J�L�P�W���E�^�N�t�[��,,,�o�^�L�`������,������,,���ꌧ�ߔe�s�񗢖��g��2-124-2,,,,,,,,,�l���L,2007/7/31,,,,,,,,,,,,
472018,47,���ꌧ,�ߔe�s,�V�_�ƏZ��r,�A���J�L�P�W���E�^�N�q�K�V�C�P,,,�o�^�L�`������,������,,���ꌧ�ߔe�s�񗢖��g��2-124-2,,,,,,,,,�l���L,2007/7/31,,,,,,,,,,,,
472018,48,���ꌧ,�ߔe�s,�V�_�ƏZ���r,�A���J�L�P�W���E�^�N�~�i�~�C�P,,,�o�^�L�`������,������,,���ꌧ�ߔe�s�񗢖��g��2-124-2,,,,,,,,,�l���L,2007/7/31,,,,,,,,,,,,
472018,49,���ꌧ,�ߔe�s,���~�o������,�L���E�G���J�N�W�\�E����,,,���w��L�`������,������;���@���z,,���ꌧ�ߔe�s�񗢓�����2-1,,,,,,,,,���ꌧ,1972/5/12,,,,,,,,,,,,
472018,50,���ꌧ,�ߔe�s,���񗢏����,�L���E�V�����W���E�V�����C����,,,���w��L�`������,������;��s���z,,���ꌧ�ߔe�s�񗢓�����3,,,,,,,,,���ꌧ,1972/5/12,,,,,,,,,,,,
472018,51,���ꌧ,�ߔe�s,���g�{�C��,�X�G���V�O�E�g�E�h�E,,,���w��L�`������,������;����,,���ꌧ�ߔe�s�񗢖��g��1,,,,,,,,,���g�{,1956/2/22,,,,,,,,,,,,
472018,52,���ꌧ,�ߔe�s,������,�����E�G���L���E,,,���w��L�`������,������;����,,���ꌧ�ߔe�s�񗢓�����1-2,,,,,,,,,�ߔe�s,1959/1/29,,,,,,,,,,,,
472018,53,���ꌧ,�ߔe�s,�q�W�싴�y�ю�t���H,�q�W�K���o�V�I���r�g���c�P�h�E��,,,���w��L�`������,������;����,,���ꌧ�ߔe�s���^�n,,,,,,,,,���ꌧ,1959/12/16,,,,,,,,,,,,
472018,54,���ꌧ,�ߔe�s,�≮�r�Ă̂ڂ�q�����,�c�{���m�A�����`�m�{���K�}�t�Z�L�V���E,,,���w��L�`������,������;���̑�,,���ꌧ�ߔe�s�≮1-86,,,,,,,,,���ꓩ��i���j,1973/3/19,,,,,,,,,,,,
472018,55,���ꌧ,�ߔe�s,�����M����V�},�W�����E�q�c�n�N�^�N�m�Y,,,���w��L�`������,���p�H�|�i;�G��,�񗢏�����Ǘ�����,���ꌧ�ߔe�s�񗢋��钬1-2,,,,,,,,,��ʍ��c�@�l������瓇���c,1958/1/17,,,,,,,,,,,,
472018,56,���ꌧ,�ߔe�s,���{���F�Ԓ��}�i�u���ǕM�j,�P���|���`���N�V���N�J�`���E�Y�i�C���Q�������E�q�c�j,,,���w��L�`������,���p�H�|�i;�G��,���ꌧ�������فE���p��,���ꌧ�ߔe�s������܂�3-1-1,,,,098-941-8200,,,,,���ꌧ,1979/4/9,,,,,,,,,,,,
472018,57,���ꌧ,�ߔe�s,���{���F�ᒆ賎q�̐}�i�u���ǕM�j,�V�z���`���N�V���N�Z�b�`���E�L�W�m�Y�i�C���Q�������E�q�c�j,,,���w��L�`������,���p�H�|�i;�G��,���ꌧ�������فE���p��,���ꌧ�ߔe�s������܂�3-1-1,,,,098-941-8200,,,,,���ꌧ,1979/4/9,,,,,,,,,,,,
472018,58,���ꌧ,�ߔe�s,���{���F��g�����},�V�z���`���N�V���N�z�E�V�����E�L���E�Y,,,���w��L�`������,���p�H�|�i;�G��,���ꌧ�������فE���p��,���ꌧ�ߔe�s������܂�3-1-1,,,,098-941-8200,,,,,���ꌧ,1982/3/4,,,,,,,,,,,,
472018,59,���ꌧ,�ߔe�s,���{�n��|�̐}�i�u���ǕM�j,�V�z���{�N�K�^�P�m�Y�i�C���Q�������E�q�c�j,,,���w��L�`������,���p�H�|�i;�G��,���ꌧ�������فE���p��,���ꌧ�ߔe�s������܂�3-1-1,,,,098-941-8200,,,,,���ꌧ,1982/3/4,,,,,,,,,,,,
472018,60,���ꌧ,�ߔe�s,���{���F�����g�s��},�V�z���`���N�V���N�T�b�|�E�V�M���E���c�Y,,,���w��L�`������,���p�H�|�i;�G��,���ꌧ�������فE���p��,���ꌧ�ߔe�s������܂�3-1-1,,,,098-941-8200,,,,,���ꌧ,2003/7/11,,,,,,,,,,,,
472018,61,���ꌧ,�ߔe�s,�_�L�}�i�R���@�G�M�j,�V���r���E�Y�i���}�O�`�\�E�L�q�c�j,,,���w��L�`������,���p�H�|�i;�G��,�ߔe�s���j������,���ꌧ�ߔe�s�v�Βn1-1-1�p���b�g������4�K,,,,098-869-5266,,,,,�ߔe�s,2006/9/12,,,,,,,,,,,,
472018,62,���ꌧ,�ߔe�s,���������n��,�\�E�Q���W�Q�o�q,,,���w��L�`������,���p�H�|�i;����,,���ꌧ�ߔe�s��1-9-1,,,,,,,,,�ߔe�s,1955/1/25,,,,,,,,,,,,
472018,63,���ꌧ,�ߔe�s,�~�o�������r�΋�����,�G���J�N�W�z�E�W���E�`�C�V�o�V�R�E����,,,���w��L�`������,���p�H�|�i;����,,���ꌧ�ߔe�s�񗢓�����2-1,,,,,,,,,���ꌧ,1956/12/14,,,,,,,,,,,,
472018,64,���ꌧ,�ߔe�s,�ʗːΒ����q,�^�}�E�h�D���Z�L�`���E�W�V,,,���w��L�`������,���p�H�|�i;����,,���ꌧ�ߔe�s�񗢋��钬1-3,,,,,,,,,�ߔe�s,1956/12/14,,,,,,,,,,,,
472018,65,���ꌧ,�ߔe�s,�ؒ��~�o�����ە��тɎ�ӏ��؎D,���N�`���E�G���J�N�W�r���N�]�E�i���r�j�V���C�V���L�t�_,,,���w��L�`������,���p�H�|�i;����,���ꌧ�������فE���p��,���ꌧ�ߔe�s������܂�3-1-1,,,,098-941-8200,,,,,���ꌧ,1956/12/14,,,,,,,,,,,,
472018,66,���ꌧ,�ߔe�s,�����������H��,�����`�o�V�R�E�����n��,,,���w��L�`������,���p�H�|�i;����,���ꌧ�������فE���p��,���ꌧ�ߔe�s������܂�3-1-1,,,,098-941-8200,,,,,���ꌧ,1956/12/14,,,,,,,,,,,,
472018,67,���ꌧ,�ߔe�s,�ʗ˔�,�^�}�E�h�D���q,,,���w��L�`������,���p�H�|�i;����,,���ꌧ�ߔe�s�񗢋��钬1-3,,,,,,,,,�ߔe�s,1959/1/29,,,,,,,,,,,,
472018,68,���ꌧ,�ߔe�s,���~�o���֌W�ؒ�����,�L���E�G���J�N�W�J���P�C���N�`���E�V�����E,,,���w��L�`������,���p�H�|�i;����,���ꌧ�������فE���p��,���ꌧ�ߔe�s������܂�3-1-1,,,,098-941-8200,,,,,���ꌧ,2003/7/11,,,,,,,,,,,,
472018,69,���ꌧ,�ߔe�s,������N��a�_��������,�L�R�G�I�I�L�~�E�h�D���E�������E�I�E�S���J���U�V,,,���w��L�`������,���p�H�|�i;�H�|�i;���H,���ꌧ�������فE���p��,���ꌧ�ߔe�s������܂�3-1-1,,,,098-941-8200,,,,,���ꌧ,1956/12/14,,,,,,,,,,,,
472018,70,���ꌧ,�ߔe�s,�����i����i�������j,�h�E�V���E�i�L���E�C�b�|���S���Q���V���E�j,,,���w��L�`������,���p�H�|�i;�H�|�i;���H,���ꌧ�������فE���p��,���ꌧ�ߔe�s������܂�3-1-1,,,,098-941-8200,,,,,���ꌧ,1985/6/18,,,,,,,,,,,,
472018,71,���ꌧ,�ߔe�s,�����i���V���a���j,�h�E�V���E�i�L���E�e���\���f���V���E�j,,,���w��L�`������,���p�H�|�i;�H�|�i;���H,���ꌧ�������فE���p��,���ꌧ�ߔe�s������܂�3-1-1,,,,098-941-8200,,,,,���ꌧ,1985/6/18,,,,,,,,,,,,
472018,72,���ꌧ,�ߔe�s,�����i���V�܋{���j,�h�E�V���E�i�L���E�e���s�O�E�V���E�j,,,���w��L�`������,���p�H�|�i;�H�|�i;���H,���ꌧ�������فE���p��,���ꌧ�ߔe�s������܂�3-1-1,,,,098-941-8200,,,,,���ꌧ,1985/6/18,,,,,,,,,,,,
472018,73,���ꌧ,�ߔe�s,�����i���V�����ɏ��j,�{���V���E�i�L���E�e�������E�V���E�V���V���E�j,,,���w��L�`������,���p�H�|�i;�H�|�i;���H,���ꌧ�������فE���p��,���ꌧ�ߔe�s������܂�3-1-1,,,,098-941-8200,,,,,���ꌧ,1985/6/18,,,,,,,,,,,,
472018,74,���ꌧ,�ߔe�s,�����i������T�����j,�{���V���E�i�L���E�t�����[���W�V���E�j,,,���w��L�`������,���p�H�|�i;�H�|�i;���H,���ꌧ�������فE���p��,���ꌧ�ߔe�s������܂�3-1-1,,,,098-941-8200,,,,,���ꌧ,1985/6/18,,,,,,,,,,,,
472018,75,���ꌧ,�ߔe�s,�����i���쉞�����j,�{���V���E�i�L���E���C�I�E�W�V���E�j,,,���w��L�`������,���p�H�|�i;�H�|�i;���H,���ꌧ�������فE���p��,���ꌧ�ߔe�s������܂�3-1-1,,,,098-941-8200,,,,,���ꌧ,1985/6/18,,,,,,,,,,,,
472018,76,���ꌧ,�ߔe�s,�����i������T�����j,�{���V���E�i�L���E�^�C�A�[���W�V���E�j,,,���w��L�`������,���p�H�|�i;�H�|�i;���H,���ꌧ�������فE���p��,���ꌧ�ߔe�s������܂�3-1-1,,,,098-941-8200,,,,,���ꌧ,1988/1/12,,,,,,,,,,,,
472018,77,���ꌧ,�ߔe�s,�����i���i�������j,�{���V���E�i�L���E�G�C�t�N�W�V���E�j,,,���w��L�`������,���p�H�|�i;�H�|�i;���H,���ꌧ�������فE���p��,���ꌧ�ߔe�s������܂�3-1-1,,,,098-941-8200,,,,,���ꌧ,1990/2/6,,,,,,,,,,,,
472018,78,���ꌧ,�ߔe�s,���h�͋юR���G�啶��,�N���k���c�C�L���T���X�C�G�_�C�u���R,,,���w��L�`������,���p�H�|�i;�H�|�i;���H,���ꌧ�������فE���p��,���ꌧ�ߔe�s������܂�3-1-1,,,,098-941-8200,,,,,���ꌧ,1956/12/14,,,,,,,,,,,,
472018,79,���ꌧ,�ߔe�s,���h����_�����������W�t�o,�N���k�����f���E�������E�����E�`�L���p�N�t�^�c�L����,,,���w��L�`������,���p�H�|�i;�H�|�i;���H,���ꌧ�������فE���p��,���ꌧ�ߔe�s������܂�3-1-1,,,,098-941-8200,,,,,���ꌧ,1956/12/14,,,,,,,,,,,,
472018,80,���ꌧ,�ߔe�s,���h����V��G�啶��,�N���k�����f�����E�K���G�_�C�u���R,,,���w��L�`������,���p�H�|�i;�H�|�i;���H,���ꌧ�������فE���p��,���ꌧ�ߔe�s������܂�3-1-1,,,,098-941-8200,,,,,���ꌧ,1956/12/14,,,,,,,,,,,,
472018,81,���ꌧ,�ߔe�s,�����K�N�͋ю��~,�N���E���V�o���c�C�L���W�N�{��,,,���w��L�`������,���p�H�|�i;�H�|�i;���H,���ꌧ�������فE���p��,���ꌧ�ߔe�s������܂�3-1-1,,,,098-941-8200,,,,,���ꌧ,1990/2/6,,,,,,,,,,,,
472018,82,���ꌧ,�ߔe�s,�����R���O�t�l�������,�N���E���V�T���X�C���E�J�N�W���u�c���f���c�N�G,,,���w��L�`������,���p�H�|�i;�H�|�i;���H,���ꌧ�������فE���p��,���ꌧ�ߔe�s������܂�3-1-1,,,,098-941-8200,,,,,���ꌧ,1990/2/6,,,,,,,,,,,,
472018,83,���ꌧ,�ߔe�s,�鎽�R���O�t�l�����G�ی^�����~,�V���E���V�T���X�C���E�J�N�W���u�c�n�N�G�}���K�^�g�D���_�[�u��,,,���w��L�`������,���p�H�|�i;�H�|�i;���H,���ꌧ�������فE���p��,���ꌧ�ߔe�s������܂�3-1-1,,,,098-941-8200,,,,,���ꌧ,1990/2/6,,,,,,,,,,,,
472018,84,���ꌧ,�ߔe�s,�鎽�b�䉲�O������䋟��,�V���E���V�g���G�����{�^���`���L���_�C�E�N�t�@��,,,���w��L�`������,���p�H�|�i;�H�|�i;���H,���ꌧ�������فE���p��,���ꌧ�ߔe�s������܂�3-1-1,,,,098-941-8200,,,,,���ꌧ,1990/2/6,,,,,,,,,,,,
472018,85,���ꌧ,�ߔe�s,�����ɎR���O�t�l�����G���G�p�~,�V���~�c�_�T���X�C���E�J�N�W���u�c�n�N�G�J�N�{��,,,���w��L�`������,���p�H�|�i;�H�|�i;���H,���ꌧ�������فE���p��,���ꌧ�ߔe�s������܂�3-1-1,,,,098-941-8200,,,,,���ꌧ,1990/2/6,,,,,,,,,,,,
472018,86,���ꌧ,�ߔe�s,�����e�Ԓ�������q�����H��,�N���E���V�L�b�J�`���E�`���E�V�b�|�E�c�i�M�`���L���W�L���E,,,���w��L�`������,���p�H�|�i;�H�|�i;���H,�񗢏�����Ǘ�����,���ꌧ�ߔe�s�񗢋��钬1-2,,,,,,,,,��ʍ��c�@�l������瓇���c,2006/9/12,,,,,,,,,,,,
472018,87,���ꌧ,�ߔe�s,�������O����q�����H��,�N���E���V�{�^���V�b�|�E�c�i�M�`���L���W�L���E,,,���w��L�`������,���p�H�|�i;�H�|�i;���H,�񗢏�����Ǘ�����,���ꌧ�ߔe�s�񗢋��钬1-2,,,,,,,,,��ʍ��c�@�l������瓇���c,2006/9/12,,,,,,,,,,,,
472018,88,���ꌧ,�ߔe�s,�F�ۛƌI�G�e�ԎM,�C���]�E�K���A���G�L�N�J�U��,,,���w��L�`������,���p�H�|�i;�H�|�i;����,���ꌧ�������فE���p��,���ꌧ�ߔe�s������܂�3-1-1,,,,098-941-8200,,,,,���ꌧ,1979/9/3,,,,,,,,,,,,
472018,89,���ꌧ,�ߔe�s,�}�~�|��ԊG�o,�G�_�E���^�P�����A�J�G����,,,���w��L�`������,���p�H�|�i;�H�|�i;����,���ꌧ�������فE���p��,���ꌧ�ߔe�s������܂�3-1-1,,,,098-941-8200,,,,,���ꌧ,1979/9/3,,,,,,,,,,,,
472018,90,���ꌧ,�ߔe�s,�������t�����M,�Z���{���\���c�P�M�������U��,,,���w��L�`������,���p�H�|�i;�H�|�i;����,���ꌧ�������فE���p��,���ꌧ�ߔe�s������܂�3-1-1,,,,098-941-8200,,,,,���ꌧ,1979/9/3,,,,,,,,,,,,
472018,91,���ꌧ,�ߔe�s,�ۛƐF���ʎ���r,�]�E�K���C���T�V�����g���_�`�r��,,,���w��L�`������,���p�H�|�i;�H�|�i;����,���ꌧ�������فE���p��,���ꌧ�ߔe�s������܂�3-1-1,,,,098-941-8200,,,,,���ꌧ,1979/9/3,,,,,,,,,,,,
472018,92,���ꌧ,�ߔe�s,�O���u�����J��,�T���V���V�^�n�N�P�[�W���E,,,���w��L�`������,���p�H�|�i;�H�|�i;�y��,���ꌧ�������فE���p��,���ꌧ�ߔe�s������܂�3-1-1,,,,098-941-8200,,,,,�l��,1955/5/23,,,,,,,,,,,,
472018,93,���ꌧ,�ߔe�s,�O���N��J��,�T���V�����N�K���P�[�W���E,,,���w��L�`������,���p�H�|�i;�H�|�i;�y��,,���ꌧ�ߔe�s�񗢓�����,,,,,,,,,�l��,1955/5/23,,,,,,,,,,,,
472018,94,���ꌧ,�ߔe�s,�O���]�˗^��,�T���V���G�h���i�[,,,���w��L�`������,���p�H�|�i;�H�|�i;�y��,���ꌧ�������فE���p��,���ꌧ�ߔe�s������܂�3-1-1,,,,098-941-8200,,,,,���ꌧ,1956/12/14,,,,,,,,,,,,
472018,95,���ꌧ,�ߔe�s,�O���앗���^�i�q�́j,�T���V���n�G�o���K�^�i�n�C�����E�j,,,���w��L�`������,���p�H�|�i;�H�|�i;�y��,���ꌧ�������فE���p��,���ꌧ�ߔe�s������܂�3-1-1,,,,098-941-8200,,,,,�l��,1958/8/15,,,,,,,,,,,,
472018,96,���ꌧ,�ߔe�s,�O���v��t�a�^,�T���V���N�o�V�����f���K�^,,,���w��L�`������,���p�H�|�i;�H�|�i;�y��,���ꌧ�������فE���p��,���ꌧ�ߔe�s������܂�3-1-1,,,,098-941-8200,,,,,�l��,1958/8/15,,,,,,,,,,,,
472018,97,���ꌧ,�ߔe�s,�O���v�t�̍��^,�T���V���N�o�m�t�j�K�^,,,���w��L�`������,���p�H�|�i;�H�|�i;�y��,���ꌧ�������فE���p��,���ꌧ�ߔe�s������܂�3-1-1,,,,098-941-8200,,,,,�l��,1958/8/15,,,,,,,,,,,,
472018,98,���ꌧ,�ߔe�s,�O���^�ǌ^������,�T���V���}�J�r�K�^���C�j�V�q��,,,���w��L�`������,���p�H�|�i;�H�|�i;�y��,���ꌧ�������فE���p��,���ꌧ�ߔe�s������܂�3-1-1,,,,098-941-8200,,,,,���ꌧ,1994/3/15,,,,,,,,,,,,
472018,99,���ꌧ,�ߔe�s,�O���^�ǌ^������,�T���V���}�J�r�K�^���C�A����,,,���w��L�`������,���p�H�|�i;�H�|�i;�y��,���ꌧ�������فE���p��,���ꌧ�ߔe�s������܂�3-1-1,,,,098-941-8200,,,,,�l��,1994/3/15,,,,,,,,,,,,
472018,100,���ꌧ,�ߔe�s,�O���^�ǌ^,�T���V���}�J�r�K�^,,,���w��L�`������,���p�H�|�i;�H�|�i;�y��,���ꌧ�������فE���p��,���ꌧ�ߔe�s������܂�3-1-1,,,,098-941-8200,,,,,�l��,1994/3/15,,,,,,,,,,,,
472018,101,���ꌧ,�ߔe�s,�O���^�ߏ�^���ʏ��o��,�T���V�����i�O�V�N�K�^���C�^�}�O�V�N���i,,,���w��L�`������,���p�H�|�i;�H�|�i;�y��,���ꌧ�������فE���p��,���ꌧ�ߔe�s������܂�3-1-1,,,,098-941-8200,,,,,���ꌧ,1994/3/15,,,,,,,,,,,,
472018,102,���ꌧ,�ߔe�s,�O���앗���^,�T���V���n�G�o���K�^,,,���w��L�`������,���p�H�|�i;�H�|�i;�y��,,���ꌧ�ߔe�s�q�u,,,,,,,,,�l��,1958/8/15,,,,,,,,,,,,
472018,103,���ꌧ,�ߔe�s,�O����^�ǌ^����,�T���V���E�t�}�J�x,,,���w��L�`������,���p�H�|�i;�H�|�i;�y��,,���ꌧ�ߔe�s����,,,,,,,,,�l��,1994/3/15,,,,,,,,,,,,
472018,104,���ꌧ,�ߔe�s,�O���x���J������,�T���V���g�����P�[�W���E,,,���w��L�`������,���p�H�|�i;�H�|�i;�y��,���ꌧ���|�p��w,���ꌧ�ߔe�s�񗢋��钬3-6,,,,,,,,,���ꌧ,1994/3/15,,,,,,,,,,,,
472018,105,���ꌧ,�ߔe�s,�O�������J������,�T���V�������V�}�P�[�W���E,,,���w��L�`������,���p�H�|�i;�H�|�i;�y��,���ꌧ�������فE���p��,���ꌧ�ߔe�s������܂�3-1-1,,,,098-941-8200,,,,,���ꌧ,1994/3/15,,,,,,,,,,,,
472018,106,���ꌧ,�ߔe�s,��̏�,�T�C�I���m�V��,,,���w��L�`������,���p�H�|�i;�H�|�i;����,,���ꌧ�ߔe�s�O��,,,,,,,,,�l��,1967/4/11,,,,,,,,,,,,
472018,107,���ꌧ,�ߔe�s,�������̏�,�e�C�W�����\�N�m�V��,,,���w��L�`������,���p�H�|�i;�H�|�i;����,���ꌧ�������فE���p��,���ꌧ�ߔe�s������܂�3-1-1,,,,098-941-8200,,,,,���ꌧ,1967/4/11,,,,,,,,,,,,
472018,108,���ꌧ,�ߔe�s,�G�z�u�����v�A���̏�,�w���K�N�u�g�N�^�J�V�v�e�C�Q���C�V��,,,���w��L�`������,���p�H�|�i;�H�|�i;����,���ꌧ�������فE���p��,���ꌧ�ߔe�s������܂�3-1-1,,,,098-941-8200,,,,,���ꌧ,1989/9/29,,,,,,,,,,,,
472018,109,���ꌧ,�ߔe�s,�G�z�u���_�v�ї�  ��,�w���K�N�u�����E�E���v���������V���E�V��,,,���w��L�`������,���p�H�|�i;�H�|�i;����,���ꌧ�������فE���p��,���ꌧ�ߔe�s������܂�3-1-1,,,,098-941-8200,,,,,���ꌧ,1989/9/29,,,,,,,,,,,,
472018,110,���ꌧ,�ߔe�s,�]�菊�i���{�w���R���Ӂx,�q���E�W���E�V���J�N�S�e�C�z���w�`���E�U���Z�C�J���x,,,���w��L�`������,���p�H�|�i;�H�|�i;�T��,���ꌧ�������فE���p��,���ꌧ�ߔe�s������܂�3-1-1,,,,098-941-8200,,,,,���ꌧ,1956/12/14,,,,,,,,,,,,
472018,111,���ꌧ,�ߔe�s,�]�菊�i���{�w���R�����x,�q���E�W���E�V���J�N�S�e�C�z���w�`���E�U���Z�C�t�x,,,���w��L�`������,���p�H�|�i;�H�|�i;�T��,���ꌧ�������فE���p��,���ꌧ�ߔe�s������܂�3-1-1,,,,098-941-8200,,,,,���ꌧ,1956/12/14,,,,,,,,,,,,
472018,112,���ꌧ,�ߔe�s,�{�Ó����n�̎񗢑剮�q�ւ̎��ߏ�,�~���R�W�}�V���W�m�V�����I�I���R�w�m�W���C�V��,,,���w��L�`������,���p�H�|�i;�H�|�i;�Õ���,���ꌧ�������فE���p��,���ꌧ�ߔe�s������܂�3-1-1,,,,098-941-8200,,,,,���ꌧ,1956/12/14,,,,,,,,,,,,
472018,113,���ꌧ,�ߔe�s,�ɕ��������c�̎񗢑剮�q�ւ̎��ߏ�,�C�w���W�}�i�J�_�m�V�����I�I���R�w�m�W���C�V��,,,���w��L�`������,���p�H�|�i;�H�|�i;�Õ���,���ꌧ�������فE���p��,���ꌧ�ߔe�s������܂�3-1-1,,,,098-941-8200,,,,,���ꌧ,1978/4/1,,,,,,,,,,,,
472018,114,���ꌧ,�ߔe�s,�H�n�Ԑ؂̉���̂�ւ̎��ߏ�,�n�l�W�}�M���m���K�m���w�m�W���C�V��,,,���w��L�`������,���p�H�|�i;�H�|�i;�Õ���,���ꌧ�������فE���p��,���ꌧ�ߔe�s������܂�3-1-1,,,,098-941-8200,,,,,���ꌧ,1981/3/30,,,,,,,,,,,,
472018,115,���ꌧ,�ߔe�s,�����c���i���g��{���N���j,�h�E�V���E�U���P�c�i�L���E�i�~�m�E�G�O�E�`���E�Z���V���E�j,,,���w��L�`������,���p�H�|�i;�H�|�i;���j����,���ꌧ�������فE���p��,���ꌧ�ߔe�s������܂�3-1-1,,,,098-941-8200,,,,,���ꌧ,1985/6/18,,,,,,,,,,,,
472018,116,���ꌧ,�ߔe�s,�ɍ]�Ǝ���,�C�G�P�V�����E,,,���w��L�`������,���p�H�|�i;�H�|�i;���j����,�ߔe�s���j������,���ꌧ�ߔe�s�v�Βn1-1-1�p���b�g������4�K,,,,098-869-5266,,,,,�l��,2002/1/18,,,,,,,,,,,,
472018,117,���ꌧ,�ߔe�s,����`�����y���y�c��,�I�L�i���f���g�E�I���K�N�A�t�\�����E,,,���w�薳�`������,�|�\,����`�����y���y�c���ۑ���,,,,,,,,,,�Ɗ얼�@����,1972/12/28,,,,,,,,,,,,
472018,118,���ꌧ,�ߔe�s,����`�����y�쑺��,�I�L�i���f���g�E�I���K�N�m���������E,,,���w�薳�`������,�|�\,����`�����y�쑺���ۑ���,,,,,,,,,,���@���r,1972/12/28,,,,,,,,,,,,
472018,119,���ꌧ,�ߔe�s,����`�����x,�I�L�i���f���g�E�u���E,,,���w�薳�`������,�|�\,����`�����x�ۑ���,,,,,,,,,,���܁@�N�q,1972/12/28,,,,,,,,,,,,
472018,120,���ꌧ,�ߔe�s,�����̌�,�����E�L���E�J�Q�L,,,���w�薳�`������,�|�\,�����̌��ۑ���,,,,,,,,,,�g�c�@���q,1989/9/29,,,,,,,,,,,,
472018,121,���ꌧ,�ߔe�s,�т�^,�r���K�^,,,���w�薳�`������,�H�|�Z�p,����`���т�^�ۑ���,,,,,,,,,,��ԁ@�ď�,1973/7/30,,,,,,,,,,,,
472018,122,���ꌧ,�ߔe�s,�{��񗢂̐D��,�z���o�V�����m�I�����m,,,���w�薳�`������,�H�|�Z�p,����`���{��񗢐D���ۑ���,,,,,,,,,,�j��@���q,1974/1/17,,,,,,,,,,,,
472018,123,���ꌧ,�ߔe�s,��������,�����E�L���E�V�b�L,,,���w�薳�`������,�H�|�Z�p,��������ۑ���,,,,,,,,,,�O�c�@�F��,1991/1/16,,,,,,,,,,,,
472018,124,���ꌧ,�ߔe�s,����̋��E�Õ��p,�I�L�i���m�J���e�E�R�u�W���c,,,���w�薳�`������,���E�Õ��p,,,,,,,,,,,�N��@�K���A�㌴�@���M�A���{�@�����A�����[�@���j�A��m���@�`�v,2000/9/12,,,,,,,,,,,,
472018,125,���ꌧ,�ߔe�s,���䉮�����,�\�m�q�����E�^�L�C�V����,,,���w��L�O��,�j��,,���ꌧ�ߔe�s�񗢐^�a�u��1-7,,,,,,,,,�ߔe�s,1955/11/29,,,,,,,,,,,,
472018,126,���ꌧ,�ߔe�s,���K�y�т��̎���,�����E�^���I���r�\�m�V���E�w��,,,���w��L�O��,�j��,,���ꌧ�ߔe�s�񗢐^�a�u��1-1�O,,,,,,,,,���ꌧ,1955/11/29,,,,,,,,,,,,
472018,127,���ꌧ,�ߔe�s,����L��,�T�`�q�[�W���[�J�C�d�J,,,���w��L�O��,�j��,,���ꌧ�ߔe�s���V�v,,,,,,,,,�l���L,1956/10/19,,,,,,,,,,,,
472018,128,���ꌧ,�ߔe�s,�����̑��,�i�J�V�}�m�E�t�V�[,,,���w��L�O��,�j��,,���ꌧ�ߔe�s���1-20-3,,,,,,,,,�����s�s�ĊJ����,1958/3/14,,,,,,,,,,,,
472018,129,���ꌧ,�ߔe�s,�񗢋��钬�Ώ���,�V�����L���W���E�`���E�C�V�_�^�~�~�`,,,���w��L�O��,�j��,,���ꌧ�ߔe�s�񗢋��钬2�C3,,,,,,,,,�ߔe�s,1964/5/1,,,,,,,,,,,,
472018,130,���ꌧ,�ߔe�s,�R������ꓴ�����,���}�V�^�`���E�_�C�C�`�h�E�P�c�C�Z�L,,,���w��L�O��,�j��,,���ꌧ�ߔe�s�R����167,,,,,,,,,�ߔe�s,1969/8/26,,,,,,,,,,,,
472018,131,���ꌧ,�ߔe�s,���w�E�񗢐��_�Ί_,�R�N�K�N�E�V�����Z�C�r���E�C�V�K�L,,,���w��L�O��,�j��,,���ꌧ�ߔe�s�񗢓�����1-4-1,,,,,,,,,���ꌧ,1993/6/11,,,,,,,,,,,,
472018,132,���ꌧ,�ߔe�s,�񗢋��钬�Ώ���,�V�����L���W���E�`���E�C�V�_�^�~�~�`,,,���w��L�O��,����,,���ꌧ�ߔe�s�񗢋��钬2�C3,,,,,,,,,�ߔe�s,1964/5/1,,,,,,,,,,,,
472018,133,���ꌧ,�ߔe�s,�����̑��,�i�J�V�}�m�E�t�V�[,,,���w��L�O��,�V�R�L�O��,,���ꌧ�ߔe�s���1-20-3,,,,,,,,,�����s�s�ĊJ����,1958/3/14,,,,,,,,,,,,
472018,134,���ꌧ,�ߔe�s,�񗢉��{�̘H���y,�V�����I�E�t�m���W�K�N,,,���w��I��,���`����������,���ꖯ���|�\�ۑ���,,,,,,,,,,,1978/3/24,,,,,,,,,,,,
472018,135,���ꌧ,�ߔe�s,�ǒJ�R��a�̕�,���~�^���U���E�h�D���m�n�J,,,�s�w��L�`������,������;���̑�,,���ꌧ�ߔe�s�񗢐Η䒬2����68,,,,,,,,,�ߔe�s,1984/8/1,,,,,,,,,,,,